I've just installed 2.43.9 on my Mac for the first time, created a new Blazor project to test and connected it to an existing mySQL DB running on a windows server and I'm getting designer error messages for every form.
This is a new install, not an update.
.Net Core SDK 3.1 (v3.1.100) has been installed as well as the latest Visual Studio for Mac.
radzen: Generating code ...
radzen: Code generation done in 364ms.
dotnet: watch :
dotnet: Started
dotnet: Pages/EditOdd.razor.designer.cs(61,17): error CS1002: ; expected [/Users/mike/Documents/Projects/Radzen - 1X2 Admin/server/C1X2Admin.csproj]
dotnet: Pages/EditBookmaker.razor.designer.cs(61,17): error CS1002: ; expected [/Users/mike/Documents/Projects/Radzen - 1X2 Admin/server/C1X2Admin.csproj]
dotnet: Pages/Countries.razor.designer.cs(60,17): error CS1002: ; expected [/Users/mike/Documents/Projects/Radzen - 1X2 Admin/server/C1X2Admin.csproj]
dotnet: Pages/EditSeason.razor.designer.cs(61,17): error CS1002: ; expected [/Users/mike/Documents/Projects/Radzen - 1X2 Admin/server/C1X2Admin.csproj]
Pages/Odds.razor.designer.cs(60,17): error CS1002: ; expected [/Users/mike/Documents/Projects/Radzen - 1X2 Admin/server/C1X2Admin.csproj]
Pages/EditOdd.razor.designer.cs(61,18): error CS1002: ; expected [/Users/mike/Documents/Projects/Radzen - 1X2 Admin/server/C1X2Admin.csproj]
dotnet: Pages/EditSeason.razor.designer.cs(61,18): error CS1002: ; expected [/Users/mike/Documents/Projects/Radzen - 1X2 Admin/server/C1X2Admin.csproj]
Pages/Odds.razor.designer.cs(60,18): error CS1002: ; expected [/Users/mike/Documents/Projects/Radzen - 1X2 Admin/server/C1X2Admin.csproj]
Pages/EditOdd.razor.designer.cs(61,52): error CS1002: ; expected [/Users/mike/Documents/Projects/Radzen - 1X2 Admin/server/C1X2Admin.csproj]
Pages/EditBookmaker.razor.designer.cs(61,18): error CS1002: ; expected [/Users/mike/Documents/Projects/Radzen - 1X2 Admin/server/C1X2Admin.csproj]
Pages/Odds.razor.designer.cs(60,45): error CS1002: ; expected [/Users/mike/Documents/Projects/Radzen - 1X2 Admin/server/C1X2Admin.csproj]
Pages/EditSeason.razor.designer.cs(61,57): error CS1002: ; expected [/Users/mike/Documents/Projects/Radzen - 1X2 Admin/server/C1X2Admin.csproj]
dotnet: Pages/EditBookmaker.razor.designer.cs(61,63): error CS1002: ; expected [/Users/mike/Documents/Projects/Radzen - 1X2 Admin/server/C1X2Admin.csproj]
Pages/EditCard.razor.designer.cs(61,17): error CS1002: ; expected [/Users/mike/Documents/Projects/Radzen - 1X2 Admin/server/C1X2Admin.csproj]
Pages/EditCard.razor.designer.cs(61,18): error CS1002: ; expected [/Users/mike/Documents/Projects/Radzen - 1X2 Admin/server/C1X2Admin.csproj]
dotnet: Pages/EditCard.razor.designer.cs(61,53): error CS1002: ; expected [/Users/mike/Documents/Projects/Radzen - 1X2 Admin/server/C1X2Admin.csproj]
Pages/AddLeague.razor.designer.cs(65,21): error CS1002: ; expected [/Users/mike/Documents/Projects/Radzen - 1X2 Admin/server/C1X2Admin.csproj]
Pages/AddLeague.razor.designer.cs(65,22): error CS1002: ; expected [/Users/mike/Documents/Projects/Radzen - 1X2 Admin/server/C1X2Admin.csproj]
Pages/AddLeague.razor.designer.cs(65,54): error CS1002: ; expected [/Users/mike/Documents/Projects/Radzen - 1X2 Admin/server/C1X2Admin.csproj]
Pages/AddMatch.razor.designer.cs(65,21): error CS1002: ; expected [/Users/mike/Documents/Projects/Radzen - 1X2 Admin/server/C1X2Admin.csproj]
Pages/AddMatch.razor.designer.cs(65,22): error CS1002: ; expected [/Users/mike/Documents/Projects/Radzen - 1X2 Admin/server/C1X2Admin.csproj]
Pages/AddMatch.razor.designer.cs(65,53): error CS1002: ; expected [/Users/mike/Documents/Projects/Radzen - 1X2 Admin/server/C1X2Admin.csproj]
... and so on for every form ....
dotnet:
dotnet: The build failed. Fix the build errors and run again.
dotnet: watch :
dotnet: Exited with error code 1
Please advise.
Thanks
Mike