Errror when compiling an application in Visual Studio

3>------ Build started: Project: project, Configuration: Debug Any CPU ------
3>C:\Users\Administrator\Documents\tollfree\server\Controllers\AuthController.vb(222,97): error BC30002: Type ‘ApplicationUser’ is not defined.
3>C:\Users\Administrator\Documents\tollfree\server\Controllers\AuthController.vb(222,129): error BC30002: Type ‘ApplicationUser’ is not defined.
3>Done building project “project.vbproj” – FAILED.
========== Build: 2 succeeded, 1 failed, 0 up-to-date, 0 skipped ==========

Hi,

We were able to reproduce the problem and we are working on fix.

Best Regards,
Vladimir

Hi @falves11,

Radzen 2.6.6 was just released with fix for the reported problem. You will receive the update automatically on next Radzen start.

Best Regards,
Vladimir

it does not work, I sent an email earlier.
Now when I export the app, the solution file does not get generated.
The server folder has a project file, it fails to compile with the same error

Hi,

Please double check if you are using Radzen 2.6.6 (Help -> About), delete your server folder and run the application from Radzen.

Best Regards,
Vladimir